Target
Tyrosine-protein kinase transforming protein Src [144-247]
Ligand
BDBM195582
Substrate
Meas. Tech.
Fluorescence Polarization Assay
pH
7.35±n/a
Kd
9620±1670 nM
Comments
extracted
Citation
 Ju, TNiu, WGuo, J Evolution of Src Homology 2 (SH2) Domain to Recognize Sulfotyrosine. ACS Chem Biol 11:2551-7 (2016)  
Target
Name:
Tyrosine-protein kinase transforming protein Src [144-247]
Synonyms:
SRC_RSVSA V-SRC
Type:
Protein
Mol. Mass.:
11957.88
Organism:
Rous sarcoma virus (Virus)
Description:
PDB code 1SPS
Residue:
104
  
Inhibitor
Name:
BDBM195582
Synonyms:
Sulfotyrosine (sTyr)
Type:
Small organic molecule
Emp. Form.:
C9H10NO6S
Mol. Mass.:
260.244
SMILES:
[NH3+][C@@H](Cc1ccc(OS([O-])(=O)=O)cc1)C([O-])=O
: