Target
Androgen-dependent TFPI-regulating protein
Ligand
BDBM195603
Substrate
Meas. Tech.
Gel-based ABPP Assay
IC50
1.3e+3± 4e+2 nM
Citation
 Parsons, WHKolar, MJKamat, SSCognetta, ABHulce, JJSaez, EKahn, BBSaghatelian, ACravatt, BF AIG1 and ADTRP are atypical integral membrane hydrolases that degrade bioactive FAHFAs. Nat Chem Biol 12:367-72 (2016)  
Target
Name:
Androgen-dependent TFPI-regulating protein
Synonyms:
ADTRP Androgen-dependent TFPI-regulating protein (ADTRP) | C6orf105
Type:
Protein
Mol. Mass.:
26858.19
Organism:
Homo sapiens (Human)
Description:
Residue:
230
  
Inhibitor
Name:
BDBM195603
Synonyms:
KC01
Type:
Small organic molecule
Emp. Form.:
C22H39NO3
Mol. Mass.:
365.55
SMILES:
CCCCCCCCCCCCCC1OC(=O)\C1=C/CCCCC(N)=O
: