Target
Lysine-specific demethylase 3B
Ligand
BDBM195608
Substrate
Meas. Tech.
KDM TR-FRET Assay
IC50
>2.5e+4±n/a nM
Citation
 Vinogradova, MGehling, VSGustafson, AArora, STindell, CAWilson, CWilliamson, KEGuler, GDGangurde, PManieri, WBusby, JFlynn, EMLan, FKim, HJOdate, SCochran, AGLiu, YWongchenko, MYang, YCheung, TKMaile, TMLau, TCosta, MHegde, GVJackson, EPitti, RArnott, DBailey, CBellon, SCummings, RTAlbrecht, BKHarmange, JCKiefer, JRTrojer, PClasson, M An inhibitor of KDM5 demethylases reduces survival of drug-tolerant cancer cells. Nat Chem Biol 12:531-8 (2016)  
Target
Name:
Lysine-specific demethylase 3B
Synonyms:
C5orf7 JMJD1B KDM3B_HUMAN Lysine-specific demethylase 3B | Lysine-specific demethylase 3B (KDM3B)
Type:
Protein
Mol. Mass.:
191594.20
Organism:
Homo sapiens (Human)
Description:
Q7LBC6
Residue:
1761
  
Inhibitor
Name:
BDBM195608
Synonyms:
CPI-455
Type:
Small organic molecule
Emp. Form.:
C16H14N4O
Mol. Mass.:
278.3086
SMILES:
CC(C)c1c([nH]c2c(cnn2c1=O)C#N)-c1ccccc1
: