Target
Tyrosine-protein phosphatase non-receptor type 11
Ligand
BDBM38069
Substrate
Meas. Tech.
SHP2 Allosteric Inhibition Assay
pH
7.2±n/a
Temperature
298.15±n/a K
IC50
93.0±n/a nM
Comments
extracted
Citation
 Chen, CHChen, ZFortanet, JGGrunenfelder, DKarki, RKato, MLaMarche, MJPerez, LBStams, TMWilliams, S 1-pyridazin-/triazin-3-yl-piper(-azine)/idine/pyrolidine derivatives and compositions thereof for inhibiting the activity of SHP2 US Patent  US10093646 Publication Date 10/9/2018 
Target
Name:
Tyrosine-protein phosphatase non-receptor type 11
Synonyms:
PTN11_HUMAN PTP-2C PTPN11 Protein tyrosine phosphatase (PTP) Shp2 Protein-tyrosine phosphatase 2C SHP2 Src homology phosphatase 2 (SHP-2) Tyrosine-protein phosphatase non-receptor type 11 (PTPN11) Tyrosine-protein phosphatase non-receptor type 11 (SHP2)
Type:
Protein phosphatase
Mol. Mass.:
68443.59
Organism:
Homo sapiens (Human)
Description:
Q06124
Residue:
597
  
Inhibitor
Name:
BDBM38069
Synonyms:
US10093646, Example 16
Type:
Small organic molecule
Emp. Form.:
C32H38Cl4N10O2
Mol. Mass.:
736.522
SMILES:
C[C@@]1(N)CCN(C[C@H]1O)c1cnc(c(N)n1)-c1cccc(Cl)c1Cl.C[C@]1(N)CCN(C[C@@H]1O)c1cnc(c(N)n1)-c1cccc(Cl)c1Cl
: