Target
Lysine-specific demethylase 5B
Ligand
BDBM26106
Substrate
Meas. Tech.
Demethylase AlphaScreen Assay
pH
7.5±n/a
IC50
2.45e+4±n/a nM
Comments
extracted
Citation
 Johansson, CVelupillai, STumber, ASzykowska, AHookway, ESNowak, RPStrain-Damerell, CGileadi, CPhilpott, MBurgess-Brown, NWu, NKopec, JNuzzi, ASteuber, HEgner, UBadock, VMunro, SLaThangue, NBWestaway, SBrown, JAthanasou, NPrinjha, RBrennan, PEOppermann, U Structural analysis of human KDM5B guides histone demethylase inhibitor development. Nat Chem Biol 12:539-45 (2016)  
Target
Name:
Lysine-specific demethylase 5B
Synonyms:
CT31 Histone demethylase JARID1B Jumonji/ARID domain-containing protein 1B KDM5B_HUMAN Lysine-specific demethylase 5B (KDM5Flag-5B-FL) PLU1 RBP2-H1 | Retinoblastoma-binding protein 2 homolog 1
Type:
Protein
Mol. Mass.:
175659.67
Organism:
Homo sapiens (Human)
Description:
Q9UGL1
Residue:
1544
  
Inhibitor
Name:
BDBM26106
Synonyms:
CHEMBL90852 NOG [(carboxymethyl)carbamoyl]formic acid
Type:
Small organic molecule
Emp. Form.:
C4H5NO5
Mol. Mass.:
147.0862
SMILES:
OC(=O)CNC(=O)C(O)=O
: