Target
Prolactin-releasing peptide receptor
Ligand
BDBM195751
Substrate
Meas. Tech.
Inhibition Assay
pH
7.4±n/a
Temperature
298.15±n/a K
Ki
17±n/a nM
Comments
extracted
Citation
 Takahashi, ASuzuki, MNakamura, YSakurai, Y Heterocyclic compounds for the treatment of stress-related conditions US Patent  US9206173 Publication Date 12/8/2015 
Target
Name:
Prolactin-releasing peptide receptor
Synonyms:
G-protein coupled receptor 10 (GPR10) GR3 PRLHR_HUMAN Prolactin-releasing peptide receptor
Type:
Protein
Mol. Mass.:
41138.32
Organism:
Homo sapiens (Human)
Description:
P49683
Residue:
370
  
Inhibitor
Name:
BDBM195751
Synonyms:
US9206173, 121
Type:
Small organic molecule
Emp. Form.:
C26H24F3N5O3S
Mol. Mass.:
543.561
SMILES:
CCOn1c(N[C@H](C)c2ccc(cc2)C(F)(F)F)nc2CCN(Cc2c1=O)C(=O)c1cc2cccnc2s1
: