Target
Prolactin-releasing peptide receptor
Ligand
BDBM195645
Substrate
Meas. Tech.
Inhibition Assay
pH
7.4±n/a
Temperature
298.15±n/a K
Ki
8±n/a nM
Comments
extracted
Citation
 Takahashi, ASuzuki, MNakamura, YSakurai, Y Heterocyclic compounds for the treatment of stress-related conditions US Patent  US9206173 Publication Date 12/8/2015 
Target
Name:
Prolactin-releasing peptide receptor
Synonyms:
G-protein coupled receptor 10 (GPR10) GR3 PRLHR_HUMAN Prolactin-releasing peptide receptor
Type:
Protein
Mol. Mass.:
41138.32
Organism:
Homo sapiens (Human)
Description:
P49683
Residue:
370
  
Inhibitor
Name:
BDBM195645
Synonyms:
US9206173, 2407
Type:
Small organic molecule
Emp. Form.:
C28H24F3N5O2
Mol. Mass.:
519.5177
SMILES:
CC#CCn1c(N[C@@H](C)c2ccc(cc2)C(F)(F)F)nc2CCN(Cc2c1=O)C(=O)c1ccc(cc1)C#N
: