Target
Tyrosine-protein kinase JAK3
Ligand
BDBM195833
Substrate
Meas. Tech.
Biochemical Inhibition Assay
IC50
<5±n/a nM
Citation
 Vankayalapati, HYerramreddy, VGangireddy, PAppalaneni, RP Substituted pyrrolo[2,3-b]pyridines as ITK and JAK inhibitors US Patent  US9206188 Publication Date 12/8/2015 
Target
Name:
Tyrosine-protein kinase JAK3
Synonyms:
JAK-3 JAK3_HUMAN Janus kinase 3 (JAK3) L-JAK | Leukocyte janus kinase
Type:
Protein
Mol. Mass.:
125111.08
Organism:
Homo sapiens (Human)
Description:
P52333
Residue:
1124
  
Inhibitor
Name:
BDBM195833
Synonyms:
US9206188, 84 | US9834551, Example 84
Type:
Small organic molecule
Emp. Form.:
C16H9ClFN3O
Mol. Mass.:
313.714
SMILES:
Fc1ccc(cc1NC(=O)C#C)-c1cnc2[nH]cc(Cl)c2c1
: