Target
DNA polymerase
Ligand
BDBM196152
Substrate
Meas. Tech.
Inhibition Assay
pH
7.4±n/a
Temperature
310.15±n/a K
IC50
30000±n/a nM
Comments
extracted
Citation
 Ricciardi, RP Therapeutic compounds for blocking DNA synthesis of POX viruses US Patent  US9211296 Publication Date 12/15/2015 
Target
Name:
DNA polymerase
Synonyms:
DNA Synthesis OPG071 | POL
Type:
Enzyme
Mol. Mass.:
116939.47
Organism:
Vaccinia virus (strain WR)
Description:
P06856
Residue:
1006
  
Inhibitor
Name:
BDBM196152
Synonyms:
US9211296, Table 6, 6
Type:
Small organic molecule
Emp. Form.:
C11H8Cl2N2O2
Mol. Mass.:
271.099
SMILES:
Cc1cc(\N=C\c2cc(Cl)cc(Cl)c2O)no1
: