Target
DNA polymerase
Ligand
BDBM196162
Substrate
Meas. Tech.
Inhibition Assay
pH
7.4±n/a
Temperature
310.15±n/a K
IC50
239000±n/a nM
Comments
extracted
Citation
 Ricciardi, RP Therapeutic compounds for blocking DNA synthesis of POX viruses US Patent  US9211296 Publication Date 12/15/2015 
Target
Name:
DNA polymerase
Synonyms:
DNA Synthesis OPG071 | POL
Type:
Enzyme
Mol. Mass.:
116939.47
Organism:
Vaccinia virus (strain WR)
Description:
P06856
Residue:
1006
  
Inhibitor
Name:
BDBM196162
Synonyms:
US9211296, Table 6, 16
Type:
Small organic molecule
Emp. Form.:
C15H20O3
Mol. Mass.:
248.3175
SMILES:
O=C1\C(CC\C1=C/C1CCCO1)=C\C1CCCO1
: