Target
DNA polymerase
Ligand
BDBM196133
Substrate
Meas. Tech.
Inhibition Assay
pH
7.4±n/a
Temperature
310.15±n/a K
IC50
3000±n/a nM
Comments
extracted
Citation
 Ricciardi, RP Therapeutic compounds for blocking DNA synthesis of POX viruses US Patent  US9211296 Publication Date 12/15/2015 
Target
Name:
DNA polymerase
Synonyms:
DNA Synthesis OPG071 | POL
Type:
Enzyme
Mol. Mass.:
116939.47
Organism:
Vaccinia virus (strain WR)
Description:
P06856
Residue:
1006
  
Inhibitor
Name:
BDBM196133
Synonyms:
US9211296, Table 7, Compd: 3
Type:
Small organic molecule
Emp. Form.:
C21H23N2O
Mol. Mass.:
319.4196
SMILES:
CN(C)c1ccc(cc1)-c1cccc([o+]1)-c1ccc(cc1)N(C)C
: