Target
DNA polymerase
Ligand
BDBM196140
Substrate
Meas. Tech.
Inhibition Assay
pH
7.4±n/a
Temperature
310.15±n/a K
IC50
6300±n/a nM
Comments
extracted
Citation
 Ricciardi, RP Therapeutic compounds for blocking DNA synthesis of POX viruses US Patent  US9211296 Publication Date 12/15/2015 
Target
Name:
DNA polymerase
Synonyms:
DNA Synthesis OPG071 | POL
Type:
Enzyme
Mol. Mass.:
116939.47
Organism:
Vaccinia virus (strain WR)
Description:
P06856
Residue:
1006
  
Inhibitor
Name:
BDBM196140
Synonyms:
US9211296, Table 7, Compd: 13
Type:
Small organic molecule
Emp. Form.:
C19H21Br2N3O
Mol. Mass.:
467.198
SMILES:
OC(CN1CCNCC1)Cn1c2ccc(Br)cc2c2cc(Br)ccc12
: