Target
Alpha-1,6-mannosyl-glycoprotein 2-beta-N-acetylglucosaminyltransferase
Ligand
BDBM289042
Substrate
Meas. Tech.
MGAT LCMS Assay
pH
7.4±n/a
IC50
10.00±n/a nM
Comments
extracted
Citation
 Ahmad, S Tetrazolone-substituted dihydropyridinone MGAT2 inhibitors US Patent  US10093650 Publication Date 10/9/2018 
Target
Name:
Alpha-1,6-mannosyl-glycoprotein 2-beta-N-acetylglucosaminyltransferase
Synonyms:
2.4.1.143 GNT-II MGAT2 Mannoside acetylglucosaminyltransferase 2 Monoacylglycerol acyltransferase type 2 (h-MGAT2) h-MGAT2 (human monoacylglycerol acyltransferase type 2)
Type:
Mol. Mass.:
51567.80
Organism:
Homo sapiens (Human)
Description:
Q10469
Residue:
447
  
Inhibitor
Name:
BDBM289042
Synonyms:
US10093650, Example 19 US11479538, Example 19
Type:
Small organic molecule
Emp. Form.:
C23H21F6N5O4S
Mol. Mass.:
577.499
SMILES:
CC(O)c1ccc(s1)C1=C(C(=O)N[C@@](C1)(c1ccc(OCCCC(F)(F)F)cc1)C(F)(F)F)n1nn[nH]c1=O
: