Target
Metabotropic glutamate receptor 5
Ligand
BDBM196511
Substrate
Meas. Tech.
Radioligand Binding Assay
pH
7.4±n/a
Temperature
298.15±n/a K
Ki
11±n/a nM
Comments
extracted
Citation
 Doller, DLi, G Bicarbocyclic and tricarbocyclic ethynyl derivatives and uses of same US Patent  US9212165 Publication Date 12/15/2015 
Target
Name:
Metabotropic glutamate receptor 5
Synonyms:
GPRC1E GRM5_HUMAN metabotropic glutamate 5 | metabotropic glutamate 5a
Type:
Enzyme
Mol. Mass.:
132484.72
Organism:
Homo sapiens (Human)
Description:
Residue:
1212
  
Inhibitor
Name:
BDBM196511
Synonyms:
US9212165, 20
Type:
Small organic molecule
Emp. Form.:
C21H20FN3O
Mol. Mass.:
349.4014
SMILES:
Fc1ccc(nc1)C(=O)N[C@]12CC[C@](C1)(CCC2)C#Cc1ccccn1
: