Target
Metabotropic glutamate receptor 5
Ligand
BDBM196530
Substrate
Meas. Tech.
Radioligand Binding Assay
pH
7.4±n/a
Temperature
298.15±n/a K
Ki
120±n/a nM
Comments
extracted
Citation
 Doller, DLi, G Bicarbocyclic and tricarbocyclic ethynyl derivatives and uses of same US Patent  US9212165 Publication Date 12/15/2015 
Target
Name:
Metabotropic glutamate receptor 5
Synonyms:
GPRC1E GRM5_HUMAN metabotropic glutamate 5 | metabotropic glutamate 5a
Type:
Enzyme
Mol. Mass.:
132484.72
Organism:
Homo sapiens (Human)
Description:
Residue:
1212
  
Inhibitor
Name:
BDBM196530
Synonyms:
US9212165, 81
Type:
Small organic molecule
Emp. Form.:
C21H24N4OS
Mol. Mass.:
380.506
SMILES:
Cc1csc(n1)C#CC12CC3CC(CC(C3)(C1)NC(=O)c1ccn(C)n1)C2
: