Target
Metabotropic glutamate receptor 5
Ligand
BDBM196529
Substrate
Meas. Tech.
Calcium Mobilization Assay
pH
7.4±n/a
IC50
700±n/a nM
Comments
extracted
Citation
 Doller, DLi, G Bicarbocyclic and tricarbocyclic ethynyl derivatives and uses of same US Patent  US9212165 Publication Date 12/15/2015 
Target
Name:
Metabotropic glutamate receptor 5
Synonyms:
GPRC1E GRM5_HUMAN metabotropic glutamate 5 | metabotropic glutamate 5a
Type:
Enzyme
Mol. Mass.:
132484.72
Organism:
Homo sapiens (Human)
Description:
Residue:
1212
  
Inhibitor
Name:
BDBM196529
Synonyms:
US9212165, 80
Type:
Small organic molecule
Emp. Form.:
C23H24N4O
Mol. Mass.:
372.4629
SMILES:
Cc1ccc(cn1)C#CC12CC3CC(CC(C3)(C1)NC(=O)c1cnccn1)C2
: