Target
Histone deacetylase 6 [84-835,H651V]
Ligand
BDBM198125
Substrate
Meas. Tech.
HDAC6 fluorescence anisotropy assay
Temperature
298.15±n/a K
Kd
30000±20000 nM
Comments
extracted
Citation
 Hai, YUniversity of Pennsylvania,, DW Histone deacetylase 6 structure and molecular basis of catalysis and inhibition Nat Chem Biol 12:741-747 (2016)  
Target
Name:
Histone deacetylase 6 [84-835,H651V]
Synonyms:
HDAC6 KIAA0901 hCD12 H651V
Type:
Mol. Mass.:
82777.02
Organism:
Homo sapiens (Human)
Description:
Q9UBN7[84-835,H651V]
Residue:
752
  
Inhibitor
Name:
BDBM198125
Synonyms:
fl-SAHA
Type:
Small organic molecule
Emp. Form.:
C28H26N2O8
Mol. Mass.:
518.5146
SMILES:
ONC(=O)CCCCCCC(=O)Nc1ccc(c(c1)C(O)=O)-c1c2ccc(O)cc2oc2cc(=O)ccc12
: