Target
Prostaglandin D2 receptor 2
Ligand
BDBM197042
Substrate
Meas. Tech.
Radioligand Binding Assay
pH
7.4±n/a
Ki
0.3±n/a nM
Comments
extracted
Citation
 Martyres, DAnderskewitz, RHoenke, CKriegl, JOost, TRist, WSeither, P Pyrazole compounds as CRTH2 antagonists US Patent  US9206164 Publication Date 12/8/2015 
Target
Name:
Prostaglandin D2 receptor 2
Synonyms:
CD_antigen=CD294 Chemoattractant Receptor-homologous molecule expressed on T-helper type 2 cells (CRTH2) Chemoattractant receptor-homologous molecule expressed on Th2 cells (CRTH2) G protein-coupled receptor 44 GPR44 PTGDR2 Prostaglandin D2 receptor 2 | Prostaglandin D2 receptor 2 (PGD2)
Type:
Enzyme
Mol. Mass.:
43295.45
Organism:
Homo sapiens (Human)
Description:
Q9Y5Y4
Residue:
395
  
Inhibitor
Name:
BDBM197042
Synonyms:
US9206164, 106
Type:
Small organic molecule
Emp. Form.:
C24H24ClFN4O2
Mol. Mass.:
454.924
SMILES:
CCc1nn(Cc2ccc(cc2F)-c2nc3cc(C)c(Cl)cc3[nH]2)c(CC)c1CC(O)=O
: