Target
Nitric oxide synthase, brain
Ligand
BDBM196649
Substrate
Meas. Tech.
Inhibition Assay
pH
7.4±n/a
IC50
35±n/a nM
Comments
extracted
Citation
 Silverman, RBCinelli, MA 2-aminoquinoline-based compounds for potent and selective neuronal nitric oxide synthase inhibition US Patent  US9212144 Publication Date 12/15/2015 
Target
Name:
Nitric oxide synthase, brain
Synonyms:
Bnos NC-NOS NOS type I nNOS Neuronal nitric oxide synthase Nitric Oxide Synthase, brain Nitric oxide synthase, brain (nNOS) Nitric-oxide synthase, brain (nNOS) Nos1 | Peptidyl-cysteine S-nitrosylase NOS1
Type:
Enzyme
Mol. Mass.:
160570.98
Organism:
Rattus norvegicus (rat)
Description:
Recombinant nNOS overexpressed in E. coli was used in enzyme assays.
Residue:
1429
  
Inhibitor
Name:
BDBM196649
Synonyms:
US9212144, 4
Type:
Small organic molecule
Emp. Form.:
C20H20ClN3S
Mol. Mass.:
369.911
SMILES:
Clc1cccc(CNCCc2ccc(NC(=N)c3cccs3)cc2)c1
: