Target
Cyclin-dependent kinase/G2/mitotic-specific cyclin- 1
Ligand
BDBM5666
Substrate
Histone H1
Meas. Tech.
Kinase Inhibition assay
pH
8±n/a
Temperature
303.15±n/a K
IC50
10±n/a nM
Citation
 Kim, KSKimball, SDMisra, RNRawlins, DBHunt, JTXiao, HYLu, SQian, LHan, WCShan, WMitt, TCai, ZWPoss, MAZhu, HSack, JSTokarski, JSChang, CYPavletich, NKamath, AHumphreys, WGMarathe, PBursuker, IKellar, KARoongta, UBatorsky, RMulheron, JGBol, DFairchild, CRLee, FYWebster, KR Discovery of aminothiazole inhibitors of cyclin-dependent kinase 2: synthesis, X-ray crystallographic analysis, and biological activities. J Med Chem 45:3905-27 (2002)  
Target
Name:
Cyclin-dependent kinase/G2/mitotic-specific cyclin- 1
Synonyms:
CDK1/B CDK1/CyclinB Cyclin-Dependent Kinase 1 (CDK1) Cyclin-dependent kinase/G2/mitotic-specific cyclin 1 | cdk1
Type:
Protein Complex
Mol. Mass.:
Description:
CDK1/Cyclin B complexes were purified from insect cells co-infected with baculovirus vectors containing each of the components.
Components:
This complex has 2 components.
Component 1
Name:
Cyclin-dependent kinase 1
Synonyms:
CDC2 CDK1 CDKN1 Cell division protein kinase 1 P34CDC2 | p34 protein kinase
Type:
Enzyme Subunit
Mol. Mass.:
34101.08
Organism:
Homo sapiens (Human)
Description:
P06493
Residue:
297
  
Component 2
Name:
G2/mitotic-specific cyclin-B1
Synonyms:
CCNB CCNB1_HUMAN
Type:
Enzyme Subunit
Mol. Mass.:
48340.95
Organism:
Homo sapiens (Human)
Description:
P14635
Residue:
433
  
Inhibitor
Name:
BDBM5666
Synonyms:
2-amino-5-thio-substituted thiazole 40 N-(2,6-Difluorophenyl)-N-[5-[[[5-tert-butyl-2-oxazolyl]-methyl]thio]-2-thiazolyl]urea
Type:
Small organic molecule
Emp. Form.:
C18H18F2N4O2S2
Mol. Mass.:
424.488
SMILES:
CC(C)(C)c1cnc(CSc2cnc(NC(=O)Nc3c(F)cccc3F)s2)o1
:
Substrate
Name:
Histone H1
Synonyms:
Type:
Other Protein Type
Mol. Mass.:
358.43
Organism:
Bos taurus (bovine)
Description:
25 uM ATP/0.2 uCi[gamma-33P] as co-substrate.
Residue:
3
NA