Target
Cyclin-dependent kinase 4/G1/S-specific cyclin-D1
Ligand
BDBM5682
Substrate
GST-Rb fusion protein
Meas. Tech.
Kinase Inhibition assay
IC50
4510±n/a nM
Citation
 Kim, KSKimball, SDMisra, RNRawlins, DBHunt, JTXiao, HYLu, SQian, LHan, WCShan, WMitt, TCai, ZWPoss, MAZhu, HSack, JSTokarski, JSChang, CYPavletich, NKamath, AHumphreys, WGMarathe, PBursuker, IKellar, KARoongta, UBatorsky, RMulheron, JGBol, DFairchild, CRLee, FYWebster, KR Discovery of aminothiazole inhibitors of cyclin-dependent kinase 2: synthesis, X-ray crystallographic analysis, and biological activities. J Med Chem 45:3905-27 (2002)  
Target
Name:
Cyclin-dependent kinase 4/G1/S-specific cyclin-D1
Synonyms:
CDK4/CycD CDK4/Cyclin D1 Cyclin-Dependent Kinase 4 (CDK4) Cyclin-dependent kinase 4/G1/S-specific cyclin D1 | Cyclin-dependent kinase 4/cyclin D1
Type:
Protein Complex
Mol. Mass.:
Description:
CDK4/D1 complexes were purified from insect cells co-infected with baculovirus vectors containing each of the components.
Components:
This complex has 2 components.
Component 1
Name:
Cyclin-dependent kinase 4
Synonyms:
CDK4 Cell division protein kinase 4 PSK-J3
Type:
Enzyme Subunit
Mol. Mass.:
33731.96
Organism:
Homo sapiens (Human)
Description:
P11802
Residue:
303
  
Component 2
Name:
G1/S-specific cyclin-D1
Synonyms:
B-cell lymphoma 1 protein BCL-1 oncogene CCND1 PRAD1 | PRAD1 oncogene
Type:
Enzyme Subunit
Mol. Mass.:
33717.70
Organism:
Homo sapiens (Human)
Description:
Residue:
295
  
Inhibitor
Name:
BDBM5682
Synonyms:
2-amino-5-thio-substituted thiazole 27 N-[5-[[[5-Phenyl-2-oxazolyl]methyl]thio]-2-thiazolyl]acetamide
Type:
Small organic molecule
Emp. Form.:
C15H13N3O2S2
Mol. Mass.:
331.413
SMILES:
CC(=O)Nc1ncc(SCc2ncc(o2)-c2ccccc2)s1
:
Substrate
Name:
GST-Rb fusion protein
Synonyms:
Glutathione S-transferase (GST)-retinoblastoma (Rb) fusion RB1 Rb | retinoblastoma
Type:
Other Protein Type
Mol. Mass.:
106410.17
Organism:
Homo sapiens (Human)
Description:
GST-60 kDa Rb fusion protein (comprising amino acids 378 to 928 of retinoblastoma)
Residue:
928