Target
Metabotropic glutamate receptor 4
Ligand
BDBM196926
Substrate
Meas. Tech.
Pharmacological Assay
EC50
1100±400 nM
Citation
 Acher, FPin, JGoudet, CEschalier, ABusserolles, JRigault, DLemasson, ICesarini, SCommare, B Hypophosphorous acid derivatives having antihyperalgic activity and biological applications thereof US Patent  US9212196 Publication Date 12/15/2015 
Target
Name:
Metabotropic glutamate receptor 4
Synonyms:
GRM4_RAT Grm4 Metabotropic glutamate receptor 4 (mGlu4) mGlu4 metabotropic glutamate 4a
Type:
Enzyme
Mol. Mass.:
101849.79
Organism:
Rattus norvegicus (Rat)
Description:
P31423
Residue:
912
  
Inhibitor
Name:
BDBM196926
Synonyms:
US9212196, Derivative 22
Type:
Small organic molecule
Emp. Form.:
C13H18NO9P
Mol. Mass.:
363.2571
SMILES:
N[C@H](CCP(O)(=O)C(O)c1ccc(OCC(O)=O)c(O)c1)C(O)=O
: