Target
Metabotropic glutamate receptor 8
Ligand
BDBM196936
Substrate
Meas. Tech.
Pharmacological Assay
EC50
>100000±n/a nM
Citation
 Acher, FPin, JGoudet, CEschalier, ABusserolles, JRigault, DLemasson, ICesarini, SCommare, B Hypophosphorous acid derivatives having antihyperalgic activity and biological applications thereof US Patent  US9212196 Publication Date 12/15/2015 
Target
Name:
Metabotropic glutamate receptor 8
Synonyms:
GRM8_RAT Grm8 Metabotropic glutamate receptor 8 (mGlu8) glutamate receptor, metabotropic 8 precursor metabotropic glutamate 8
Type:
Enzyme
Mol. Mass.:
101886.18
Organism:
Rattus norvegicus (Rat)
Description:
P70579
Residue:
908
  
Inhibitor
Name:
BDBM196936
Synonyms:
US9212196, Derivative 32
Type:
Small organic molecule
Emp. Form.:
C14H17F3NO8P
Mol. Mass.:
415.2557
SMILES:
N[C@H](CCP(O)(=O)Cc1ccc(OCC(O)=O)c(OC(F)(F)F)c1)C(O)=O
: