Target
Metabotropic glutamate receptor 7
Ligand
BDBM196910
Substrate
Meas. Tech.
Pharmacological Assay
EC50
3500±1300 nM
Citation
 Acher, FPin, JGoudet, CEschalier, ABusserolles, JRigault, DLemasson, ICesarini, SCommare, B Hypophosphorous acid derivatives having antihyperalgic activity and biological applications thereof US Patent  US9212196 Publication Date 12/15/2015 
Target
Name:
Metabotropic glutamate receptor 7
Synonyms:
GRM7_RAT Grm7 Metabotropic glutamate receptor 7 (mGlu7) mGlu7
Type:
Enzyme
Mol. Mass.:
102244.48
Organism:
Rattus norvegicus (Rat)
Description:
P35400
Residue:
915
  
Inhibitor
Name:
BDBM196910
Synonyms:
US9212196, Derivative 6
Type:
Small organic molecule
Emp. Form.:
C14H19FNO9P
Mol. Mass.:
395.2741
SMILES:
COc1cc(cc(F)c1OCC(O)=O)C(O)P(O)(=O)CC[C@@H](N)C(O)=O
: