Target
Metabotropic glutamate receptor 7
Ligand
BDBM196929
Substrate
Meas. Tech.
Pharmacological Assay
EC50
15200±3900 nM
Citation
 Acher, FPin, JGoudet, CEschalier, ABusserolles, JRigault, DLemasson, ICesarini, SCommare, B Hypophosphorous acid derivatives having antihyperalgic activity and biological applications thereof US Patent  US9212196 Publication Date 12/15/2015 
Target
Name:
Metabotropic glutamate receptor 7
Synonyms:
GRM7_RAT Grm7 Metabotropic glutamate receptor 7 (mGlu7) mGlu7
Type:
Enzyme
Mol. Mass.:
102244.48
Organism:
Rattus norvegicus (Rat)
Description:
P35400
Residue:
915
  
Inhibitor
Name:
BDBM196929
Synonyms:
US9212196, Derivative 25
Type:
Small organic molecule
Emp. Form.:
C13H17N2O9PS
Mol. Mass.:
408.321
SMILES:
N[C@H](CCP(O)(=O)C(O)c1ccc(SCC(O)=O)c(c1)[N+]([O-])=O)C(O)=O
: