Target
Fatty acid-binding protein, liver
Ligand
BDBM197168
Substrate
BDBM60925
Meas. Tech.
FABP1 Fluorescent Ligand Displacement Assay
Ki
4e+1± 4 nM
Citation
 Huang, HMcIntosh, ALMartin, GGLandrock, DChung, SLandrock, KKDangott, LJLi, SKier, ABSchroeder, F FABP1: A Novel Hepatic Endocannabinoid and Cannabinoid Binding Protein. Biochemistry 55:5243-55 (2016)  
Target
Name:
Fatty acid-binding protein, liver
Synonyms:
FABPL_MOUSE Fabpl | Liver fatty acid binding protein (FABP1)
Type:
Protein
Mol. Mass.:
14247.91
Organism:
Mus musculus (Mouse)
Description:
Residue:
127
  
Inhibitor
Name:
BDBM197168
Synonyms:
(Z)-N-[(2S)-1-hydroxy-3-(4-hydroxyphenyl)propan-2-yl]octadec-9-enamide | OMDM1
Type:
Small organic molecule
Emp. Form.:
C27H45NO3
Mol. Mass.:
431.6511
SMILES:
CCCCCCCC\C=C/CCCCCCCC(=O)N[C@H](CO)Cc1ccc(O)cc1
:
Substrate
Name:
BDBM60925
Synonyms:
cis-Parinaroyl CoA
Type:
Emp. Form.:
C39H62N7O17P3S
Mol. Mass.:
1025.933
SMILES:
CC\C=C\C=C/C=C\C=C\CCCCCCCC(=O)SCCNC(=O)CCNC(=O)[C@H](O)C(C)(C)COP(O)(=O)OP(O)(=O)OC[C@H]1O[C@H]([C@H](O)[C@@H]1OP(O)(O)=O)n1cnc2c(N)ncnc12
: