Target
Histone deacetylase 6
Ligand
BDBM50020872
Substrate
Meas. Tech.
Enzyme Assay
IC50
4324±n/a nM
Citation
 Nan, FChen, FZhang, YLi, JZhou, YSu, MDing, JMeng, LXie, XWang, S Thiazole compounds, methods for preparation and use thereof US Patent  US9216962 Publication Date 12/22/2015 
Target
Name:
Histone deacetylase 6
Synonyms:
Cereblon/Histone deacetylase 6 HDAC6 Histone deacetylase 6 (HDAC6) KIAA0901 | ORF Names:JM21
Type:
Chromatin regulator; hydrolase; repressor
Mol. Mass.:
131381.51
Organism:
Homo sapiens (Human)
Description:
Q9UBN7
Residue:
1215
  
Inhibitor
Name:
BDBM50020872
Synonyms:
CHEMBL3287010 | US9216962, CFH426-S
Type:
Small organic molecule
Emp. Form.:
C18H23N3O3S3
Mol. Mass.:
425.589
SMILES:
CC(C)[C@H](NC(=O)c1csc(n1)-c1csc(C)n1)C(=O)OC\C=C\CCS
: