Target
Prostaglandin E synthase
Ligand
BDBM197594
Substrate
Meas. Tech.
Inhibition Assay
IC50
0.4±n/a nM
Citation
 Otsu, H Heterocyclic derivative and pharmaceutical drug US Patent  US9216968 Publication Date 12/22/2015 
Target
Name:
Prostaglandin E synthase
Synonyms:
MGST1L1 PGES PTGES Prostaglandin E synthase (PGES-1) Prostaglandin E synthase-1 (PGES-1) Prostaglandin E2 synthase-1 ( mPGES-1)
Type:
Protein
Mol. Mass.:
17112.22
Organism:
Homo sapiens (Human)
Description:
Residue:
152
  
Inhibitor
Name:
BDBM197594
Synonyms:
US9216968, 194 | US9732066, 194
Type:
Small organic molecule
Emp. Form.:
C27H26Cl2FN5O3
Mol. Mass.:
558.431
SMILES:
CC(C)OCCNc1nc2c(cc(NC(=O)c3c(F)cccc3Cl)cc2[nH]1)C(=O)Nc1cccc(Cl)c1C
: