Target
D(1A) dopamine receptor
Ligand
BDBM289103
Substrate
Meas. Tech.
Human D1 Receptor Binding Assay
pH
7.4±n/a
Ki
6.91±n/a nM
Comments
extracted
Citation
 Brodney, MADavoren, JEDounay, ABEfremov, IVGray, DLGreen, MEHenderson, JLLee, CMente, SRO Neil, SVRogers, BNZhang, L Heteroaromatic compounds and their use as dopamine D1 ligands US Patent  US10093655 Publication Date 10/9/2018 
Target
Name:
D(1A) dopamine receptor
Synonyms:
DA D1 receptor DRD1 Dopamine D1 receptor Dopamine D1A
Type:
Enzyme
Mol. Mass.:
49303.43
Organism:
Homo sapiens (Human)
Description:
P21728
Residue:
446
  
Inhibitor
Name:
BDBM289103
Synonyms:
(−)-6-(4-{[3-(Difluoromethoxy)pyridin-2-yl]oxy}-2-methylphenyl)-1,5-dimethylpyrimidine-2,4(1H,3H)-dione (13) | US10093655, Example 13
Type:
Small organic molecule
Emp. Form.:
C18H14F2N3O4
Mol. Mass.:
374.3183
SMILES:
Cc1c(-c2ccc(Oc3ncccc3OC(F)F)cc2)n(C)c(=O)nc1=O
: