Target
D(1A) dopamine receptor
Ligand
BDBM160884
Substrate
Meas. Tech.
Human D1 Receptor Binding Assay
pH
7.4±n/a
Ki
24.2±n/a nM
Comments
extracted
Citation
 Brodney, MADavoren, JEDounay, ABEfremov, IVGray, DLGreen, MEHenderson, JLLee, CMente, SRO Neil, SVRogers, BNZhang, L Heteroaromatic compounds and their use as dopamine D1 ligands US Patent  US10093655 Publication Date 10/9/2018 
Target
Name:
D(1A) dopamine receptor
Synonyms:
DA D1 receptor DRD1 Dopamine D1 receptor Dopamine D1A
Type:
Enzyme
Mol. Mass.:
49303.43
Organism:
Homo sapiens (Human)
Description:
P21728
Residue:
446
  
Inhibitor
Name:
BDBM160884
Synonyms:
US10093655, Example 55 US9107923, 54 | US9107923, 55
Type:
Small organic molecule
Emp. Form.:
C18H16ClN3O3
Mol. Mass.:
357.791
SMILES:
Cc1cc(Oc2ncccc2Cl)ccc1-c1c(C)c(=O)[nH]c(=O)n1C
: