Target
D(1A) dopamine receptor
Ligand
BDBM160902
Substrate
Meas. Tech.
Human D1 Receptor Binding Assay
pH
7.4±n/a
Ki
227±n/a nM
Comments
extracted
Citation
 Brodney, MADavoren, JEDounay, ABEfremov, IVGray, DLGreen, MEHenderson, JLLee, CMente, SRO Neil, SVRogers, BNZhang, L Heteroaromatic compounds and their use as dopamine D1 ligands US Patent  US10093655 Publication Date 10/9/2018 
Target
Name:
D(1A) dopamine receptor
Synonyms:
DA D1 receptor DRD1 Dopamine D1 receptor Dopamine D1A
Type:
Enzyme
Mol. Mass.:
49303.43
Organism:
Homo sapiens (Human)
Description:
P21728
Residue:
446
  
Inhibitor
Name:
BDBM160902
Synonyms:
US10093655, Example 72 US9107923, 72
Type:
Small organic molecule
Emp. Form.:
C19H17Cl2N3O2
Mol. Mass.:
390.263
SMILES:
Cc1cc(Oc2ncc(Cl)c(C)c2Cl)ccc1-c1c(C)ncc(=O)n1C
: