Target
cAMP and cAMP-inhibited cGMP 3',5'-cyclic phosphodiesterase 10A [440-779]
Ligand
BDBM197771
Substrate
Meas. Tech.
Inhibition Assay
Temperature
298.15±n/a K
IC50
59±n/a nM
Comments
extracted
Citation
 Kehler, JNielsen, JPüschl, AKilburn, JPLanggård, M Quinoline derivatives as PDE10A enzyme inhibitors US Patent  US9216986 Publication Date 12/22/2015 
Target
Name:
cAMP and cAMP-inhibited cGMP 3',5'-cyclic phosphodiesterase 10A [440-779]
Synonyms:
PDE10A PED10A | Phosphodiesterase 10A (PDE10A)
Type:
Mol. Mass.:
39060.01
Organism:
Homo sapiens (Human)
Description:
Q9Y233[440-779]
Residue:
340
  
Inhibitor
Name:
BDBM197771
Synonyms:
US9216986, 7-Chloro-2-[2-(5,8-dimethyl-[1,2,4]triazolo[1,5-a]pyrazin-2-yl)-ethyl]-quinoline-6-carbonitrile
Type:
Small organic molecule
Emp. Form.:
C19H15ClN6
Mol. Mass.:
362.816
SMILES:
Cc1cnc(C)c2nc(CCc3ccc4cc(C#N)c(Cl)cc4n3)nn12
: