Target
Complement factor B
Ligand
BDBM159309
Substrate
Meas. Tech.
Human Complement Factor B TR-FRET Assay
IC50
1.70±n/a nM
Citation
 Adams, CMCapparelli, MPEhara, TKarki, RGMainolfi, NZhang, C Piperidinyl-indole derivatives complement factor B inhibitors and uses thereof US Patent  US9682968 Publication Date 6/20/2017 
Target
Name:
Complement factor B
Synonyms:
BF CFAB_HUMAN | CFB
Type:
Enzyme
Mol. Mass.:
85537.97
Organism:
Homo sapiens (Human)
Description:
P00751
Residue:
764
  
Inhibitor
Name:
BDBM159309
Synonyms:
US10093663, Example 15 US9682968, Example-15
Type:
Small organic molecule
Emp. Form.:
C25H30N2O3
Mol. Mass.:
406.5173
SMILES:
COC1CCN(Cc2c(C)cc(C)c3[nH]ccc23)C(C1)c1ccc(cc1)C(=O)OC
: