Target
Complement factor B
Ligand
BDBM159322
Substrate
Meas. Tech.
Human Complement Factor B TR-FRET Assay
IC50
4.50±n/a nM
Citation
 Adams, CMCapparelli, MPEhara, TKarki, RGMainolfi, NZhang, C Piperidinyl-indole derivatives complement factor B inhibitors and uses thereof US Patent  US9682968 Publication Date 6/20/2017 
Target
Name:
Complement factor B
Synonyms:
BF CFAB_HUMAN | CFB
Type:
Enzyme
Mol. Mass.:
85537.97
Organism:
Homo sapiens (Human)
Description:
P00751
Residue:
764
  
Inhibitor
Name:
BDBM159322
Synonyms:
US10093663, Example 17-7 | US9682968, Example-17-7
Type:
Small organic molecule
Emp. Form.:
C21H25N3O
Mol. Mass.:
335.4427
SMILES:
COc1cc(C)c2[nH]ccc2c1CN1CCCCC1c1cccnc1
: