Target
Complement factor B
Ligand
BDBM159970
Substrate
Meas. Tech.
Human Complement Factor B TR-FRET Assay
IC50
0.01±n/a nM
Citation
 Adams, CMCapparelli, MPEhara, TKarki, RGMainolfi, NZhang, C Piperidinyl-indole derivatives complement factor B inhibitors and uses thereof US Patent  US9682968 Publication Date 6/20/2017 
Target
Name:
Complement factor B
Synonyms:
BF CFAB_HUMAN | CFB
Type:
Enzyme
Mol. Mass.:
85537.97
Organism:
Homo sapiens (Human)
Description:
P00751
Residue:
764
  
Inhibitor
Name:
BDBM159970
Synonyms:
US10093663, Example 20a | US9682968, Example-20a
Type:
Small organic molecule
Emp. Form.:
C24H28N2O3
Mol. Mass.:
392.4907
SMILES:
COc1cc(C)c2[nH]ccc2c1CN1CC[C@@H](C)C[C@H]1c1ccc(cc1)C(O)=O
: