Target
Complement factor B
Ligand
BDBM160487
Substrate
Meas. Tech.
Human Complement Factor B TR-FRET Assay
IC50
1.50±n/a nM
Citation
 Adams, CMCapparelli, MPEhara, TKarki, RGMainolfi, NZhang, C Piperidinyl-indole derivatives complement factor B inhibitors and uses thereof US Patent  US9682968 Publication Date 6/20/2017 
Target
Name:
Complement factor B
Synonyms:
BF CFAB_HUMAN | CFB
Type:
Enzyme
Mol. Mass.:
85537.97
Organism:
Homo sapiens (Human)
Description:
P00751
Residue:
764
  
Inhibitor
Name:
BDBM160487
Synonyms:
US10093663, Example 30-1 US9682968, Example-30-1
Type:
Small organic molecule
Emp. Form.:
C24H28N2O4
Mol. Mass.:
408.4901
SMILES:
COC1CCC(N(Cc2c(OC)cc(C)c3[nH]ccc23)C1)c1ccc(cc1)C(O)=O
: