Target
Complement factor B
Ligand
BDBM160495
Substrate
Meas. Tech.
Human Complement Factor B TR-FRET Assay
IC50
0.34±n/a nM
Citation
 Adams, CMCapparelli, MPEhara, TKarki, RGMainolfi, NZhang, C Piperidinyl-indole derivatives complement factor B inhibitors and uses thereof US Patent  US9682968 Publication Date 6/20/2017 
Target
Name:
Complement factor B
Synonyms:
BF CFAB_HUMAN | CFB
Type:
Enzyme
Mol. Mass.:
85537.97
Organism:
Homo sapiens (Human)
Description:
P00751
Residue:
764
  
Inhibitor
Name:
BDBM160495
Synonyms:
US10093663, Example 32-3 | US9682968, Example-32-3
Type:
Small organic molecule
Emp. Form.:
C24H30N2O3
Mol. Mass.:
394.5066
SMILES:
COC1CCN(Cc2c(OC)cc(C)c3[nH]ccc23)C(C1)c1ccc(CO)cc1
: