Target
Complement factor B
Ligand
BDBM160496
Substrate
Meas. Tech.
Human Complement Factor B TR-FRET Assay
IC50
1.20±n/a nM
Citation
 Adams, CMCapparelli, MPEhara, TKarki, RGMainolfi, NZhang, C Piperidinyl-indole derivatives complement factor B inhibitors and uses thereof US Patent  US9682968 Publication Date 6/20/2017 
Target
Name:
Complement factor B
Synonyms:
BF CFAB_HUMAN | CFB
Type:
Enzyme
Mol. Mass.:
85537.97
Organism:
Homo sapiens (Human)
Description:
P00751
Residue:
764
  
Inhibitor
Name:
BDBM160496
Synonyms:
US10093663, Example 33 | US9682968, Example-33
Type:
Small organic molecule
Emp. Form.:
C23H26N6
Mol. Mass.:
386.4927
SMILES:
Cc1cc(C)c2[nH]ccc2c1CN1CCCCC1c1cccc(c1)-c1nn[nH]n1
: