Target
Complement factor B
Ligand
BDBM160508
Substrate
Meas. Tech.
Human Complement Factor B TR-FRET Assay
IC50
0.24±n/a nM
Citation
 Adams, CMCapparelli, MPEhara, TKarki, RGMainolfi, NZhang, C Piperidinyl-indole derivatives complement factor B inhibitors and uses thereof US Patent  US9682968 Publication Date 6/20/2017 
Target
Name:
Complement factor B
Synonyms:
BF CFAB_HUMAN | CFB
Type:
Enzyme
Mol. Mass.:
85537.97
Organism:
Homo sapiens (Human)
Description:
P00751
Residue:
764
  
Inhibitor
Name:
BDBM160508
Synonyms:
US10093663, Example 42 | US9682968, Example-42
Type:
Small organic molecule
Emp. Form.:
C27H34N2O4
Mol. Mass.:
450.5699
SMILES:
CCO[C@H]1CCN(Cc2c(OC)cc(C)c3[nH]ccc23)[C@@H](C1)c1ccc(cc1)C(=O)OCC
: