Target
DNA topoisomerase 2-alpha
Ligand
BDBM198138
Substrate
Meas. Tech.
Topoisomerase IIα Relaxation Assay
pH
7.9±n/a
IC50
4.2831e+5±n/a nM
Comments
extracted
Citation
 Alam, RWahi, DSingh, RSinha, DTandon, VGrover, ARahisuddin, null Design, synthesis, cytotoxicity, HuTopoIIa inhibitory activity and molecular docking studies of pyrazole derivatives as potential anticancer agents. Bioorg Chem 69:77-90 (2016)  
Target
Name:
DNA topoisomerase 2-alpha
Synonyms:
DNA topoisomerase 2-alpha DNA topoisomerase II (Topo II) DNA topoisomerase II, alpha isozyme TOP2A Topoisomerase I/II | Topoisomerase II alpha (HuTopoIIα)
Type:
Protein
Mol. Mass.:
174415.30
Organism:
Homo sapiens (Human)
Description:
P11388
Residue:
1531
  
Inhibitor
Name:
BDBM198138
Synonyms:
Ethyl 4-(3-(4-methoxyphenyl)-1-phenyl-1H-pyrazol-4-yl)-2-oxo-6-(pyridin-3-yl)cyclohex-3-enecarboxylate (5i)
Type:
Small organic molecule
Emp. Form.:
C30H27N3O4
Mol. Mass.:
493.5531
SMILES:
CCOC(=O)C1C(CC(=CC1=O)c1cn(nc1-c1ccc(OC)cc1)-c1ccccc1)c1cccnc1
: