Target
DNA topoisomerase 2-alpha
Ligand
BDBM198140
Substrate
Meas. Tech.
Topoisomerase IIα Relaxation Assay
pH
7.9±n/a
IC50
2.7241e+5±n/a nM
Comments
extracted
Citation
 Alam, RWahi, DSingh, RSinha, DTandon, VGrover, ARahisuddin, null Design, synthesis, cytotoxicity, HuTopoIIa inhibitory activity and molecular docking studies of pyrazole derivatives as potential anticancer agents. Bioorg Chem 69:77-90 (2016)  
Target
Name:
DNA topoisomerase 2-alpha
Synonyms:
DNA topoisomerase 2-alpha DNA topoisomerase II (Topo II) DNA topoisomerase II, alpha isozyme TOP2A Topoisomerase I/II | Topoisomerase II alpha (HuTopoIIα)
Type:
Protein
Mol. Mass.:
174415.30
Organism:
Homo sapiens (Human)
Description:
P11388
Residue:
1531
  
Inhibitor
Name:
BDBM198140
Synonyms:
5-(3-(4-Fluorophenyl)-1-phenyl-1H-pyrazol-4-yl)-3-(pyridin-3-yl)-4,5-dihydropyrazole-1-carbothioamide (6b)
Type:
Small organic molecule
Emp. Form.:
C24H19FN6S
Mol. Mass.:
442.511
SMILES:
NC(=S)N1N=C(CC1c1cn(nc1-c1ccc(F)cc1)-c1ccccc1)c1cccnc1
: