Target
Acetylcholinesterase
Ligand
BDBM198160
Substrate
Meas. Tech.
In vitro AChE and BChE Assay
pH
8±n/a
IC50
1.11e+3± 1.0e+2 nM
Comments
extracted
Citation
 Ahmad, SIftikhar, FUllah, FSadiq, ARashid, U Rational design and synthesis of dihydropyrimidine based dual binding site acetylcholinesterase inhibitors. Bioorg Chem 69:91-101 (2016)  
Target
Name:
Acetylcholinesterase
Synonyms:
ACES_ELEEL Acetylcholinesterase (EeAChE) | ache
Type:
Enzyme
Mol. Mass.:
71812.79
Organism:
Electrophorus electricus (Electric eel)
Description:
Residue:
633
  
Inhibitor
Name:
BDBM198160
Synonyms:
2-(5-Acetyl-4-(4-chlorophenyl)-6-methyl-1,4-dihydropyrimidin-2-ylthio)-N-p-tolylacetamide (4f)
Type:
Small organic molecule
Emp. Form.:
C22H22ClN3O2S
Mol. Mass.:
427.947
SMILES:
CC(=O)C1=C(C)NC(SCC(=O)Nc2ccc(C)cc2)=NC1c1ccc(Cl)cc1
: