Target
Carboxylic ester hydrolase
Ligand
BDBM198157
Substrate
Meas. Tech.
In vitro AChE and BChE Assay
pH
8±n/a
IC50
2.454e+4± 3.19e+3 nM
Comments
extracted
Citation
 Ahmad, SIftikhar, FUllah, FSadiq, ARashid, U Rational design and synthesis of dihydropyrimidine based dual binding site acetylcholinesterase inhibitors. Bioorg Chem 69:91-101 (2016)  
Target
Name:
Carboxylic ester hydrolase
Synonyms:
BuChE Butyrylcholine esterase Butyrylcholinesterase (BChE) Butyrylcholinesterase (EqBuChE) butyrylcholinesterase precursor
Type:
Protein
Mol. Mass.:
68842.83
Organism:
Equus caballus (Horse)
Description:
Q9N1N9
Residue:
602
  
Inhibitor
Name:
BDBM198157
Synonyms:
2-(5-Acetyl-4-(4-bromophenyl)-6-methyl-1,4-dihydropyrimidin-2-ylthio)-N-phenylacetamide (4c)
Type:
Small organic molecule
Emp. Form.:
C21H20BrN3O2S
Mol. Mass.:
458.371
SMILES:
CC(=O)C1=C(C)NC(SCC(=O)Nc2ccccc2)=NC1c1ccc(Br)cc1
: