Target
Tyrosine-protein kinase JAK2
Ligand
BDBM198640
Substrate
Meas. Tech.
Enzyme Assay
pH
7.5±n/a
IC50
27±n/a nM
Citation
 Hayashi, KWatanabe, TToyama, KKamon, JMinami, MUni, MNasu, M Substituted pyrrolo[2,3-h][1,6]naphthyridines and compositions thereof as JAK inhibitors US Patent  US9216999 Publication Date 12/22/2015 
Target
Name:
Tyrosine-protein kinase JAK2
Synonyms:
JAK-2 JAK2_HUMAN Janus kinase 2 (JAK2) | Janus kinase 2 (a protein tyrosine kinase)
Type:
Protein
Mol. Mass.:
130684.68
Organism:
Homo sapiens (Human)
Description:
O60674
Residue:
1132
  
Inhibitor
Name:
BDBM198640
Synonyms:
US9216999, 433 | US9556187, Example 433
Type:
Small organic molecule
Emp. Form.:
C14H15N5
Mol. Mass.:
253.3024
SMILES:
C=C1CCC(CC1)c1nnn2cnc3[nH]ccc3c12
: