Target
Non-receptor tyrosine-protein kinase TYK2
Ligand
BDBM198412
Substrate
Meas. Tech.
Enzyme Assay
pH
7.5±n/a
IC50
>1000±n/a nM
Citation
 Hayashi, KWatanabe, TToyama, KKamon, JMinami, MUni, MNasu, M Substituted pyrrolo[2,3-h][1,6]naphthyridines and compositions thereof as JAK inhibitors US Patent  US9216999 Publication Date 12/22/2015 
Target
Name:
Non-receptor tyrosine-protein kinase TYK2
Synonyms:
Non-receptor tyrosine-protein kinase TYK2 (TYK2) TYK2_HUMAN | Tyrosine-protein kinase TYK2
Type:
Protein
Mol. Mass.:
133666.03
Organism:
Homo sapiens (Human)
Description:
P29597
Residue:
1187
  
Inhibitor
Name:
BDBM198412
Synonyms:
US9216999, 209 | US9556187, Example 209
Type:
Small organic molecule
Emp. Form.:
C18H21FN6O
Mol. Mass.:
356.3973
SMILES:
F[C@H]1CCN(C1)C(=O)[C@H]1CC[C@@H](CC1)c1nnn2cnc3[nH]ccc3c12
: