Target
Non-receptor tyrosine-protein kinase TYK2
Ligand
BDBM198517
Substrate
Meas. Tech.
Enzyme Assay
pH
7.5±n/a
IC50
750±n/a nM
Citation
 Hayashi, KWatanabe, TToyama, KKamon, JMinami, MUni, MNasu, M Substituted pyrrolo[2,3-h][1,6]naphthyridines and compositions thereof as JAK inhibitors US Patent  US9216999 Publication Date 12/22/2015 
Target
Name:
Non-receptor tyrosine-protein kinase TYK2
Synonyms:
Non-receptor tyrosine-protein kinase TYK2 (TYK2) TYK2_HUMAN | Tyrosine-protein kinase TYK2
Type:
Protein
Mol. Mass.:
133666.03
Organism:
Homo sapiens (Human)
Description:
P29597
Residue:
1187
  
Inhibitor
Name:
BDBM198517
Synonyms:
US9216999, 314 | US9556187, Example 314
Type:
Small organic molecule
Emp. Form.:
C21H28N8
Mol. Mass.:
392.5006
SMILES:
N#CCCN1CCN(C[C@H]2CC[C@@H](CC2)c2nnn3cnc4[nH]ccc4c23)CC1
: