Target
Macrophage colony-stimulating factor 1 receptor [555-568]
Ligand
BDBM119026
Substrate
Meas. Tech.
Fluorescence Polarization Competition Immunoassay
pH
7.5±n/a
IC50
>60±n/a nM
Comments
extracted
Citation
 Illig, CRBallentine, SKChen, JDesjarlais, RLMeegalla, SKWall, MWilson, K Inhibitors of c-fms kinase US Patent  US9221797 Publication Date 12/29/2015 
Target
Name:
Macrophage colony-stimulating factor 1 receptor [555-568]
Synonyms:
CSF1R FMS FMS Substrate Peptide (aa 555-568) | Macrophage colony-stimulating factor 1 receptor (CSF1R) or (c-fms)
Type:
Peptide
Mol. Mass.:
1619.64
Organism:
Homo sapiens (Human)
Description:
P07333 aa 555-568
Residue:
14
SYEGNSYTFIDPTQ
  
Inhibitor
Name:
BDBM119026
Synonyms:
US8674100, 38 | US9221797, 38
Type:
Small organic molecule
Emp. Form.:
C22H26Cl2N4O2
Mol. Mass.:
449.373
SMILES:
Clc1nc([nH]c1Cl)C(=O)Nc1ccc(CCN2CCOCC2)cc1C1=CCCCC1
: