Target
Hepatocyte growth factor receptor
Ligand
BDBM98027
Substrate
Meas. Tech.
Kinase Enzyme Assay
pH
7.5±n/a
Temperature
303.15±n/a K
IC50
0.55±n/a nM
Comments
extracted
Citation
 Zhuo, JHe, CYao, W Imidazo[1,2-B][1,2,4]triazines as c-Met inhibitors US Patent  US9221824 Publication Date 12/29/2015 
Target
Name:
Hepatocyte growth factor receptor
Synonyms:
Hepatocyte growth factor receptor Hepatocyte growth factor receptor (c-MET) MET Met proto-oncogene (hepatocyte growth factor receptor) Tyrosine-protein kinase Met (c-Met) c-Met kinase
Type:
Protein
Mol. Mass.:
155559.73
Organism:
Homo sapiens (Human)
Description:
P08581
Residue:
1390
  
Inhibitor
Name:
BDBM98027
Synonyms:
US10472367, Compound Formula I US8487096, I | US9221824, Formula I
Type:
Small organic molecule
Emp. Form.:
C25H21FN6O2
Mol. Mass.:
456.4716
SMILES:
C[C@@H](O)CNC(=O)c1ccc(cc1F)-c1cnc2ncc(Cc3ccc4ncccc4c3)n2n1
: