Target
Tyrosine-protein phosphatase non-receptor type 13
Ligand
BDBM199180
Substrate
Meas. Tech.
PTP pNPP Assay
pH
7±n/a
Temperature
298.15±n/a K
Ki
>1000±0.0 nM
Comments
extracted
Citation
 Zhang, ZZhang, S Inhibitors of protein tyrosine phosphatases US Patent  US9217012 Publication Date 12/22/2015 
Target
Name:
Tyrosine-protein phosphatase non-receptor type 13
Synonyms:
FAP-1 Fas-associated protein-tyrosine phosphatase 1 (FAP1) PNP1 PTP1E PTPN13 Tyrosine-protein phosphatase non-receptor type 13 | Tyrosine-protein phosphatase non-receptor type 13 (FAP1)
Type:
Protein
Mol. Mass.:
276896.33
Organism:
Homo sapiens (Human)
Description:
Q12923
Residue:
2485
  
Inhibitor
Name:
BDBM199180
Synonyms:
US9217012, 10
Type:
Small organic molecule
Emp. Form.:
C46H62F2N5O9P
Mol. Mass.:
897.9831
SMILES:
CCc1ccc(cc1)C(=O)NCCCCC(NC(=O)C(Cc1ccc(cc1)C(F)(F)P(O)(O)=O)NC(=O)C(Cc1ccccc1)NC(=O)COC1CC(C)CCC1C(C)C)C(N)=O
: