Target
Protein mono-ADP-ribosyltransferase PARP12 [489-701]
Ligand
BDBM199181
Substrate
Meas. Tech.
Enzymatic Activity Assay
IC50
>1.00e+5±0.0 nM
Citation
 Venkannagari, HVerheugd, PKoivunen, JHaikarainen, TObaji, EAshok, YNarwal, MPihlajaniemi, TLüscher, BLehtiö, L Small-Molecule Chemical Probe Rescues Cells from Mono-ADP-Ribosyltransferase ARTD10/PARP10-Induced Apoptosis and Sensitizes Cancer Cells to DNA Damage. Cell Chem Biol 23:1251-1260 (2016)  
Target
Name:
Protein mono-ADP-ribosyltransferase PARP12 [489-701]
Synonyms:
Human diphtheria toxin-like ADP-ribosyltransferase (ARTD12 or PARP12) PARP12 | ZC3HDC1
Type:
Mol. Mass.:
24215.90
Organism:
Homo sapiens (Human)
Description:
Q9H0J9 (489-701 aa)
Residue:
213
  
Inhibitor
Name:
BDBM199181
Synonyms:
4-[(4-Carbamoylcyclohexyl)oxy]cyclohexane-1-carboxamide (OUL35)
Type:
Small organic molecule
Emp. Form.:
C14H12N2O3
Mol. Mass.:
256.2567
SMILES:
NC(=O)c1ccc(Oc2ccc(cc2)C(N)=O)cc1
: